Target
Glucocorticoid receptor
Ligand
BDBM50167808
Substrate
Meas. Tech.
ChEMBL_305322 (CHEMBL833544)
IC50
14±n/a nM
Citation
 Smith, CJAli, ABalkovec, JMGraham, DWHammond, MLPatel, GFRouen, GPSmith, SKTata, JREinstein, MGe, LHarris, GSKelly, TMMazur, PThompson, CMWang, CFWilliamson, JMMiller, DKPandit, SSantoro, JCSitlani, AYamin, TTO'Neill, EAZaller, DMCarballo-Jane, EForrest, MJLuell, S Novel ketal ligands for the glucocorticoid receptor: in vitro and in vivo activity. Bioorg Med Chem Lett 15:2926-31 (2005)  
Target
Name:
Glucocorticoid receptor
Synonyms:
GCR_HUMAN GRL Glucocorticoid receptor (GRFP) Nuclear receptor subfamily 3 group C member 1
Type:
Enzyme
Mol. Mass.:
85656.87
Organism:
Homo sapiens (Human)
Description:
P04150
Residue:
777
  
Inhibitor
Name:
BDBM50167808
Synonyms:
1-(4-fluorophenyl)-4a-methyl-(4aS)-spiro[4,4a,5,6,7,8-hexahydro-1H-benzo[f]indazole-5,2'-(dihydro[1,3]dioxolane)] | CHEMBL196509
Type:
Small organic molecule
Emp. Form.:
C20H21FN2O2
Mol. Mass.:
340.3913
SMILES:
C[C@]12Cc3cnn(c3C=C1CCCC21OCCO1)-c1ccc(F)cc1
: