Target
Glucocorticoid receptor
Ligand
BDBM50167795
Substrate
Meas. Tech.
ChEMBL_305322 (CHEMBL833544)
IC50
24±n/a nM
Citation
 Smith, CJAli, ABalkovec, JMGraham, DWHammond, MLPatel, GFRouen, GPSmith, SKTata, JREinstein, MGe, LHarris, GSKelly, TMMazur, PThompson, CMWang, CFWilliamson, JMMiller, DKPandit, SSantoro, JCSitlani, AYamin, TTO'Neill, EAZaller, DMCarballo-Jane, EForrest, MJLuell, S Novel ketal ligands for the glucocorticoid receptor: in vitro and in vivo activity. Bioorg Med Chem Lett 15:2926-31 (2005)  
Target
Name:
Glucocorticoid receptor
Synonyms:
GCR_HUMAN GRL Glucocorticoid receptor (GRFP) Nuclear receptor subfamily 3 group C member 1
Type:
Enzyme
Mol. Mass.:
85656.87
Organism:
Homo sapiens (Human)
Description:
P04150
Residue:
777
  
Inhibitor
Name:
BDBM50167795
Synonyms:
1-(4-fluorophenyl)-4',4a,5'-trimethyl-(4'R,4aS,5'R)-spiro[1,4,4a,5,6,7-hexahydrocyclopenta[f]indazole-5,2'-(dihydro[1,3]dioxolane)] | CHEMBL194012
Type:
Small organic molecule
Emp. Form.:
C21H23FN2O2
Mol. Mass.:
354.4179
SMILES:
C[C@H]1OC2(CCC3=Cc4c(C[C@]23C)cnn4-c2ccc(F)cc2)O[C@@H]1C
: