Target
Estrogen receptor beta
Ligand
BDBM50167808
Substrate
Meas. Tech.
ChEMBL_304649 (CHEMBL828531)
IC50
>10000±n/a nM
Citation
 Smith, CJAli, ABalkovec, JMGraham, DWHammond, MLPatel, GFRouen, GPSmith, SKTata, JREinstein, MGe, LHarris, GSKelly, TMMazur, PThompson, CMWang, CFWilliamson, JMMiller, DKPandit, SSantoro, JCSitlani, AYamin, TTO'Neill, EAZaller, DMCarballo-Jane, EForrest, MJLuell, S Novel ketal ligands for the glucocorticoid receptor: in vitro and in vivo activity. Bioorg Med Chem Lett 15:2926-31 (2005)  
Target
Name:
Estrogen receptor beta
Synonyms:
ER-beta ESR2_HUMAN Estradiol receptor beta (ERβ) Estrogen receptor (ER beta) Estrogen receptor beta (ER beta) NR3A2 estrogen beta
Type:
Protein
Mol. Mass.:
59238.43
Organism:
Homo sapiens (Human)
Description:
Q92731
Residue:
530
  
Inhibitor
Name:
BDBM50167808
Synonyms:
1-(4-fluorophenyl)-4a-methyl-(4aS)-spiro[4,4a,5,6,7,8-hexahydro-1H-benzo[f]indazole-5,2'-(dihydro[1,3]dioxolane)] | CHEMBL196509
Type:
Small organic molecule
Emp. Form.:
C20H21FN2O2
Mol. Mass.:
340.3913
SMILES:
C[C@]12Cc3cnn(c3C=C1CCCC21OCCO1)-c1ccc(F)cc1
: