Target
Dipeptidyl peptidase 8
Ligand
BDBM50168268
Substrate
Meas. Tech.
ChEMBL_304640 (CHEMBL828523)
IC50
19±n/a nM
Citation
 Lu, ILLee, SJTsu, HWu, SYKao, KHChien, CHChang, YYChen, YSCheng, JHChang, CNChen, TWChang, SPChen, XJiaang, WT Glutamic acid analogues as potent dipeptidyl peptidase IV and 8 inhibitors. Bioorg Med Chem Lett 15:3271-5 (2005)  
Target
Name:
Dipeptidyl peptidase 8
Synonyms:
DPP8 DPRP-1 Dipeptidyl peptidase 8 (DPP-8) Dipeptidyl peptidase 8/9 Dipeptidyl peptidase VIII Prolyl dipeptidase DPP8
Type:
Enzyme
Mol. Mass.:
103342.62
Organism:
Homo sapiens (Human)
Description:
Q6V1X1
Residue:
898
  
Inhibitor
Name:
BDBM50168268
Synonyms:
(S)-1-[(S)-2-Amino-4-(6,7-dimethoxy-3,4-dihydro-1H-isoquinolin-2-yl)-4-oxo-butyryl]-pyrrolidine-2-carbonitrile | CHEMBL369883
Type:
Small organic molecule
Emp. Form.:
C20H26N4O4
Mol. Mass.:
386.4448
SMILES:
COc1cc2CCN(Cc2cc1OC)C(=O)C[C@H](N)C(=O)N1CCC[C@H]1C#N
: