Target
Dipeptidyl peptidase 4
Ligand
BDBM50168274
Substrate
Meas. Tech.
ChEMBL_304781 (CHEMBL829475)
IC50
73±n/a nM
Citation
 Lu, ILLee, SJTsu, HWu, SYKao, KHChien, CHChang, YYChen, YSCheng, JHChang, CNChen, TWChang, SPChen, XJiaang, WT Glutamic acid analogues as potent dipeptidyl peptidase IV and 8 inhibitors. Bioorg Med Chem Lett 15:3271-5 (2005)  
Target
Name:
Dipeptidyl peptidase 4
Synonyms:
ADABP Adenosine deaminase complexing protein 2 CD_antigen=CD26 DPP4 DPPIV Dipeptidyl peptidase 4 (DPP IV) Dipeptidyl peptidase 4 (DPP4) Dipeptidyl peptidase 4 membrane form Dipeptidyl peptidase IV Dipeptidyl peptidase IV (DDP-IV) Dipeptidyl peptidase IV membrane form Dipeptidyl peptidase-IV (DPP-4) T-cell activation antigen CD26 | TP103
Type:
Enzyme
Mol. Mass.:
88271.01
Organism:
Homo sapiens (Human)
Description:
P27487
Residue:
766
  
Inhibitor
Name:
BDBM50168274
Synonyms:
(S)-1-[(S)-2-Amino-4-(1-tert-butyl-6,7-dimethoxy-3,4-dihydro-1H-isoquinolin-2-yl)-4-oxo-butyryl]-pyrrolidine-2-carbonitrile | CHEMBL373148
Type:
Small organic molecule
Emp. Form.:
C24H34N4O4
Mol. Mass.:
442.5512
SMILES:
COc1cc2CCN(C(c2cc1OC)C(C)(C)C)C(=O)C[C@H](N)C(=O)N1CCC[C@H]1C#N
: