Target
Thromboxane A2 receptor
Ligand
BDBM50136234
Substrate
Meas. Tech.
ChEMBL_302574 (CHEMBL839535)
Ki
>1000±n/a nM
Citation
 Hattori, KTakamura, FTanaka, ATakasugi, HTaniguchi, KNishio, MKoyama, SSeki, JSakane, K Metabolism investigation leading to novel drug design: orally active prostacyclin mimetics. Part 4. Bioorg Med Chem Lett 15:3284-7 (2005)  
Target
Name:
Thromboxane A2 receptor
Synonyms:
Prostanoid TP receptor TBXA2R Thromboxane Thromboxane Beta
Type:
Enyzme
Mol. Mass.:
37445.28
Organism:
Homo sapiens (Human)
Description:
P21731
Residue:
343
  
Inhibitor
Name:
BDBM50136234
Synonyms:
CHEMBL132589 Sodium; {3-[(R)-2-(4,5-diphenyl-oxazol-2-yl)-cyclohex-2-enylmethyl]-phenoxy}-acetate Sodium; {3-[2-(4,5-diphenyl-oxazol-2-yl)-cyclohex-2-enylmethyl]-phenoxy}-acetate | sodium (S)-2-(3-((2-(4,5-diphenyloxazol-2-yl)cyclohex-2-enyl)methyl)phenoxy)acetate
Type:
Small organic molecule
Emp. Form.:
C30H26NO4
Mol. Mass.:
464.5323
SMILES:
[O-]C(=O)COc1cccc(CC2CCCC=C2c2nc(c(o2)-c2ccccc2)-c2ccccc2)c1
: