Target
Vascular endothelial growth factor receptor 1/2/3
Ligand
BDBM50168399
Substrate
Meas. Tech.
ChEMBL_312258 (CHEMBL837258)
IC50
31±n/a nM
Citation
 Borzilleri, RMZheng, XQian, LEllis, CCai, ZWWautlet, BSMortillo, SJeyaseelan, RKukral, DWFura, AKamath, AVyas, VTokarski, JSBarrish, JCHunt, JTLombardo, LJFargnoli, JBhide, RS Design, synthesis, and evaluation of orally active 4-(2,4-difluoro-5-(methoxycarbamoyl)phenylamino)pyrrolo[2,1-f][1,2,4]triazines as dual vascular endothelial growth factor receptor-2 and fibroblast growth factor receptor-1 inhibitors. J Med Chem 48:3991-4008 (2005)  
Target
Name:
Vascular endothelial growth factor receptor 1/2/3
Synonyms:
Vascular endothelial growth factor receptor
Type:
Mol. Mass.:
Description:
ASSAY_ID of ChEMBL is 213950
Components:
This complex has 3 components.
Component 1
Name:
Vascular endothelial growth factor receptor 2
Synonyms:
CD_antigen=CD309 Fetal liver kinase 1 (FLK-1) KDR Protein-tyrosine kinase receptor Flk-1 VEGFR-2 VEGFR2 Vascular Endothelial Growth Factor Receptor Kinase 2 Vascular endothelial growth factor receptor 2 (KDR) Vascular endothelial growth factor receptor 2 (VEGFR2) Vascular endothelial growth factor receptor-2 (VEGFR-2)
Type:
Receptor Tyrosine Kinase
Mol. Mass.:
151510.97
Organism:
Homo sapiens (Human)
Description:
P35968
Residue:
1356
  
Component 2
Name:
Vascular endothelial growth factor receptor 1
Synonyms:
FLT FRT Fms-like tyrosine kinase 1 Tyrosine-protein kinase FRT VEGFR-1 VGFR1_HUMAN Vascular endothelial growth factor receptor 1 (FLT1) Vascular endothelial growth factor receptor 1 and 2 (Flt-1 and KDR) Vascular permeability factor receptor vascular endothelial growth factor/vascular permeability factor receptor
Type:
Receptor Tyrosine Kinase
Mol. Mass.:
150800.23
Organism:
Homo sapiens (Human)
Description:
P17948
Residue:
1338
  
Component 3
Name:
Vascular endothelial growth factor receptor 3
Synonyms:
FLT-4 Fms-like tyrosine kinase 4 VEGFR-3 VGFR3_HUMAN Vascular endothelial growth factor receptor 3 (VEGFR-3) | Vascular endothelial growth factor receptor 3 (VEGFR3)
Type:
Protein
Mol. Mass.:
152749.58
Organism:
Homo sapiens (Human)
Description:
P35916-2
Residue:
1363
  
Inhibitor
Name:
BDBM50168399
Synonyms:
CHEMBL366019 | [4-(2,4-Difluoro-5-methoxycarbamoyl-phenylamino)-5-isopropyl-pyrrolo[2,1-f][1,2,4]triazin-6-yl]-carbamic acid ethyl ester
Type:
Small organic molecule
Emp. Form.:
C20H22F2N6O4
Mol. Mass.:
448.4233
SMILES:
CCOC(=O)Nc1cn2ncnc(Nc3cc(C(=O)NOC)c(F)cc3F)c2c1C(C)C
: