Target
Melanin-concentrating hormone receptor 1
Ligand
BDBM50168517
Substrate
Meas. Tech.
ChEMBL_313018 (CHEMBL874212)
IC50
120±n/a nM
Citation
 Vasudevan, AVerzal, MKWodka, DSouers, AJBlackburn, CChe, JLLai, SBrodjian, SFalls, DHDayton, BDGovek, EDaniels, TGeddes, BMarsh, KCHernandez, LECollins, CAKym, PR Identification of aminopiperidine benzamides as MCHr1 antagonists. Bioorg Med Chem Lett 15:3412-6 (2005)  
Target
Name:
Melanin-concentrating hormone receptor 1
Synonyms:
Gpr24 Mchr1 | Slc1
Type:
PROTEIN
Mol. Mass.:
39133.74
Organism:
Mus musculus
Description:
ChEMBL_818502
Residue:
353
  
Inhibitor
Name:
BDBM50168517
Synonyms:
CHEMBL187916 | N-(1-Benzo[1,3]dioxol-5-ylmethyl-piperidin-3-yl)-3,5-dimethoxy-benzamide
Type:
Small organic molecule
Emp. Form.:
C22H26N2O5
Mol. Mass.:
398.4522
SMILES:
COc1cc(OC)cc(c1)C(=O)NC1CCCN(Cc2ccc3OCOc3c2)C1
: