Target
Melanin-concentrating hormone receptor 1
Ligand
BDBM50168530
Substrate
Meas. Tech.
ChEMBL_306753 (CHEMBL830898)
IC50
110±n/a nM
Citation
 Vasudevan, AVerzal, MKWodka, DSouers, AJBlackburn, CChe, JLLai, SBrodjian, SFalls, DHDayton, BDGovek, EDaniels, TGeddes, BMarsh, KCHernandez, LECollins, CAKym, PR Identification of aminopiperidine benzamides as MCHr1 antagonists. Bioorg Med Chem Lett 15:3412-6 (2005)  
Target
Name:
Melanin-concentrating hormone receptor 1
Synonyms:
Gpr24 Mchr1 | Slc1
Type:
PROTEIN
Mol. Mass.:
39133.74
Organism:
Mus musculus
Description:
ChEMBL_818502
Residue:
353
  
Inhibitor
Name:
BDBM50168530
Synonyms:
3-Chloro-N-[1-((E)-3-phenyl-allyl)-piperidin-4-yl]-benzamide | CHEMBL188401
Type:
Small organic molecule
Emp. Form.:
C21H23ClN2O
Mol. Mass.:
354.873
SMILES:
Clc1cccc(c1)C(=O)NC1CCN(C\C=C\c2ccccc2)CC1
: