Target
Peroxisome proliferator-activated receptor gamma
Ligand
BDBM50168550
Substrate
Meas. Tech.
ChEMBL_310147 (CHEMBL838126)
EC50
1400±n/a nM
Citation
 Koyama, HBoueres, JKMiller, DJBerger, JPMacNaul, KLWang, PRIppolito, MCWright, SDAgrawal, AKMoller, DESahoo, SP (2R)-2-methylchromane-2-carboxylic acids: discovery of selective PPARalpha agonists as hypolipidemic agents. Bioorg Med Chem Lett 15:3347-51 (2005)  
Target
Name:
Peroxisome proliferator-activated receptor gamma
Synonyms:
NR1C3 PPAR-gamma PPARG_HUMAN Peroxisome proliferator-activated receptor gamma (PPAR gamma) Peroxisome proliferator-activated receptor gamma (PPARĪ³) peroxisome proliferator-activated receptor gamma isoform 2
Type:
Nuclear Receptor
Mol. Mass.:
57613.46
Organism:
Homo sapiens (Human)
Description:
P37231
Residue:
505
  
Inhibitor
Name:
BDBM50168550
Synonyms:
(R)-7-{3-[2-Chloro-4-(4,4-dimethyl-cyclohexyl)-phenoxy]-propoxy}-2-ethyl-chroman-2-carboxylic acid | CHEMBL178659
Type:
Small organic molecule
Emp. Form.:
C29H37ClO5
Mol. Mass.:
501.054
SMILES:
CC[C@@]1(CCc2ccc(OCCCOc3ccc(cc3Cl)C3CCC(C)(C)CC3)cc2O1)C(O)=O
: