Target
Peroxisome proliferator-activated receptor delta
Ligand
BDBM50168569
Substrate
Meas. Tech.
ChEMBL_304583 (CHEMBL828474)
IC50
>50000±n/a nM
Citation
 Koyama, HBoueres, JKMiller, DJBerger, JPMacNaul, KLWang, PRIppolito, MCWright, SDAgrawal, AKMoller, DESahoo, SP (2R)-2-methylchromane-2-carboxylic acids: discovery of selective PPARalpha agonists as hypolipidemic agents. Bioorg Med Chem Lett 15:3347-51 (2005)  
Target
Name:
Peroxisome proliferator-activated receptor delta
Synonyms:
NR1C2 NUCI Nuclear receptor subfamily 1 group C member 2 PPAR-beta PPARD Peroxisome proliferator-activated receptor Peroxisome proliferator-activated receptor delta
Type:
Enzyme
Mol. Mass.:
49910.45
Organism:
Homo sapiens (Human)
Description:
Q03181
Residue:
441
  
Inhibitor
Name:
BDBM50168569
Synonyms:
(S)-7-{3-[2-Chloro-4-(2,2,2-trifluoro-ethoxy)-phenoxy]-propoxy}-2-methyl-chroman-2-carboxylic acid | CHEMBL180928
Type:
Small organic molecule
Emp. Form.:
C22H22ClF3O6
Mol. Mass.:
474.855
SMILES:
C[C@]1(CCc2ccc(OCCCOc3ccc(OCC(F)(F)F)cc3Cl)cc2O1)C(O)=O
: