Target
Peroxisome proliferator-activated receptor alpha
Ligand
BDBM50168564
Substrate
Meas. Tech.
ChEMBL_310146 (CHEMBL838125)
EC50
120±n/a nM
Citation
 Koyama, HBoueres, JKMiller, DJBerger, JPMacNaul, KLWang, PRIppolito, MCWright, SDAgrawal, AKMoller, DESahoo, SP (2R)-2-methylchromane-2-carboxylic acids: discovery of selective PPARalpha agonists as hypolipidemic agents. Bioorg Med Chem Lett 15:3347-51 (2005)  
Target
Name:
Peroxisome proliferator-activated receptor alpha
Synonyms:
NR1C1 PPAR PPAR-alpha PPARA_HUMAN Peroxisome proliferator-activated receptor | Peroxisome proliferator-activated receptor alpha (PPAR alpha)
Type:
Enzyme
Mol. Mass.:
52222.08
Organism:
Homo sapiens (Human)
Description:
Q07869
Residue:
468
  
Inhibitor
Name:
BDBM50168564
Synonyms:
7-{3-[2-Chloro-4-(2,2,2-trifluoro-ethoxy)-phenoxy]-propoxy}-chroman-2-carboxylic acid | CHEMBL180912
Type:
Small organic molecule
Emp. Form.:
C21H20ClF3O6
Mol. Mass.:
460.828
SMILES:
OC(=O)C1CCc2ccc(OCCCOc3ccc(OCC(F)(F)F)cc3Cl)cc2O1
: