Target
Peroxisome proliferator-activated receptor gamma
Ligand
BDBM50168544
Substrate
Meas. Tech.
ChEMBL_310147 (CHEMBL838126)
EC50
400±n/a nM
Citation
 Koyama, HBoueres, JKMiller, DJBerger, JPMacNaul, KLWang, PRIppolito, MCWright, SDAgrawal, AKMoller, DESahoo, SP (2R)-2-methylchromane-2-carboxylic acids: discovery of selective PPARalpha agonists as hypolipidemic agents. Bioorg Med Chem Lett 15:3347-51 (2005)  
Target
Name:
Peroxisome proliferator-activated receptor gamma
Synonyms:
NR1C3 PPAR-gamma PPARG_HUMAN Peroxisome proliferator-activated receptor gamma (PPAR gamma) Peroxisome proliferator-activated receptor gamma (PPARĪ³) peroxisome proliferator-activated receptor gamma isoform 2
Type:
Nuclear Receptor
Mol. Mass.:
57613.46
Organism:
Homo sapiens (Human)
Description:
P37231
Residue:
505
  
Inhibitor
Name:
BDBM50168544
Synonyms:
(R)-7-[3-(2-Chloro-4-cyclohexyl-phenoxy)-propoxy]-2-ethyl-chroman-2-carboxylic acid | CHEMBL176075
Type:
Small organic molecule
Emp. Form.:
C27H33ClO5
Mol. Mass.:
473.001
SMILES:
CC[C@@]1(CCc2ccc(OCCCOc3ccc(cc3Cl)C3CCCCC3)cc2O1)C(O)=O
: