Target
Ribosomal protein S6 kinase alpha-5
Ligand
BDBM50168589
Substrate
Meas. Tech.
ChEMBL_304581 (CHEMBL828472)
IC50
107±n/a nM
Citation
 Bamford, MJAlberti, MJBailey, NDavies, SDean, DKGaiba, AGarland, SHarling, JDJung, DKPanchal, TAParr, CASteadman, JGTakle, AKTownsend, JTWilson, DMWitherington, J (1H-imidazo[4,5-c]pyridin-2-yl)-1,2,5-oxadiazol-3-ylamine derivatives: a novel class of potent MSK-1-inhibitors. Bioorg Med Chem Lett 15:3402-6 (2005)  
Target
Name:
Ribosomal protein S6 kinase alpha-5
Synonyms:
90 kDa ribosomal protein S6 kinase 5 MSK1 Nuclear mitogen- and stress-activated protein kinase 1 RPS6KA5 RSK-like protein kinase Ribosomal protein S6 kinase Ribosomal protein S6 kinase alpha-5
Type:
Serine/threonine-protein kinase
Mol. Mass.:
89874.44
Organism:
Homo sapiens (Human)
Description:
Residue:
802
  
Inhibitor
Name:
BDBM50168589
Synonyms:
3-(1-Ethyl-1H-imidazo[4,5-c]pyridin-2-yl)-pyridin-2-ylamine | CHEMBL191104
Type:
Small organic molecule
Emp. Form.:
C13H13N5
Mol. Mass.:
239.2758
SMILES:
CCn1c(nc2cnccc12)-c1cccnc1N
: