Target
Prostaglandin E synthase 2
Ligand
BDBM50168783
Substrate
Meas. Tech.
ChEMBL_305014 (CHEMBL829449)
IC50
7200±n/a nM
Citation
 Riendeau, DAspiotis, REthier, DGareau, YGrimm, ELGuay, JGuiral, SJuteau, HMancini, JAMéthot, NRubin, JFriesen, RW Inhibitors of the inducible microsomal prostaglandin E2 synthase (mPGES-1) derived from MK-886. Bioorg Med Chem Lett 15:3352-5 (2005)  
Target
Name:
Prostaglandin E synthase 2
Synonyms:
C9orf15 PGES2_HUMAN | PTGES2
Type:
Enzyme
Mol. Mass.:
41955.21
Organism:
Homo sapiens (Human)
Description:
Q9H7Z7
Residue:
377
  
Inhibitor
Name:
BDBM50168783
Synonyms:
3-[3-tert-Butylsulfanyl-1-(4-chloro-benzyl)-5-isopropyl-1H-indol-2-yl]-2,2-dimethyl-propionic acid methyl ester TCMDC-131973
Type:
Small organic molecule
Emp. Form.:
C28H36ClNO2S
Mol. Mass.:
486.109
SMILES:
COC(=O)C(C)(C)Cc1c(SC(C)(C)C)c2cc(ccc2n1Cc1ccc(Cl)cc1)C(C)C
: