Target
Cyclin-dependent kinase 2
Ligand
BDBM24996
Substrate
Meas. Tech.
ChEMBL_304606 (CHEMBL828493)
IC50
>10000±n/a nM
Citation
 Bamford, MJBailey, NDavies, SDean, DKFrancis, LPanchal, TAParr, CASehmi, SSteadman, JGTakle, AKTownsend, JTWilson, DM (1H-imidazo[4,5-c]pyridin-2-yl)-1,2,5-oxadiazol-3-ylamine derivatives: further optimisation as highly potent and selective MSK-1-inhibitors. Bioorg Med Chem Lett 15:3407-11 (2005)  
Target
Name:
Cyclin-dependent kinase 2
Synonyms:
CDK2 CDK2_HUMAN Cell division protein kinase 2 Protein cereblon/Cyclin-dependent kinase 2 | p33 protein kinase
Type:
Enzyme Subunit
Mol. Mass.:
33938.17
Organism:
Homo sapiens (Human)
Description:
P24941
Residue:
298
  
Inhibitor
Name:
BDBM24996
Synonyms:
4-{1-ethyl-7-[(piperidin-4-ylamino)methyl]-1H-imidazo[4,5-c]pyridin-2-yl}-1,2,5-oxadiazol-3-amine oxadiazole-containing compound, 9
Type:
Small organic molecule
Emp. Form.:
C16H22N8O
Mol. Mass.:
342.3989
SMILES:
CCn1c(nc2cncc(CNC3CCNCC3)c12)-c1nonc1N
: