Target
Ribosomal protein S6 kinase alpha-5
Ligand
BDBM50168866
Substrate
Meas. Tech.
ChEMBL_304566 (CHEMBL877123)
IC50
8±n/a nM
Citation
 Bamford, MJBailey, NDavies, SDean, DKFrancis, LPanchal, TAParr, CASehmi, SSteadman, JGTakle, AKTownsend, JTWilson, DM (1H-imidazo[4,5-c]pyridin-2-yl)-1,2,5-oxadiazol-3-ylamine derivatives: further optimisation as highly potent and selective MSK-1-inhibitors. Bioorg Med Chem Lett 15:3407-11 (2005)  
Target
Name:
Ribosomal protein S6 kinase alpha-5
Synonyms:
90 kDa ribosomal protein S6 kinase 5 MSK1 Nuclear mitogen- and stress-activated protein kinase 1 RPS6KA5 RSK-like protein kinase Ribosomal protein S6 kinase Ribosomal protein S6 kinase alpha-5
Type:
Serine/threonine-protein kinase
Mol. Mass.:
89874.44
Organism:
Homo sapiens (Human)
Description:
Residue:
802
  
Inhibitor
Name:
BDBM50168866
Synonyms:
4-(1-Ethyl-4-methyl-1H-imidazo[4,5-c]pyridin-2-yl)-furazan-3-ylamine | CHEMBL364413
Type:
Small organic molecule
Emp. Form.:
C11H12N6O
Mol. Mass.:
244.2526
SMILES:
CCn1c(nc2c(C)nccc12)-c1nonc1N
: