Target
Dual specificity protein phosphatase 22
Ligand
BDBM50168877
Substrate
Meas. Tech.
ChEMBL_305310 (CHEMBL831701)
IC50
13000±n/a nM
Citation
 Cutshall, NSO'Day, CPrezhdo, M Rhodanine derivatives as inhibitors of JSP-1. Bioorg Med Chem Lett 15:3374-9 (2005)  
Target
Name:
Dual specificity protein phosphatase 22
Synonyms:
DUS22_HUMAN Dual specificity phosphatase 22 Dual specificity protein phosphatase 22 Dual specificity protein phosphatase VHX (VHX) LMWDSP2 Mitogen-activated protein kinase phosphatase x | VHX
Type:
Protein
Mol. Mass.:
20915.83
Organism:
Homo sapiens (Human)
Description:
Q9NRW4
Residue:
184
  
Inhibitor
Name:
BDBM50168877
Synonyms:
2-Hydroxy-5-{4-oxo-5-[1-phenyl-meth-(Z)-ylidene]-2-thioxo-thiazolidin-3-yl}-benzoic acid | CHEMBL185578
Type:
Small organic molecule
Emp. Form.:
C17H11NO4S2
Mol. Mass.:
357.404
SMILES:
OC(=O)c1cc(ccc1O)N1C(=S)S\C(=C/c2ccccc2)C1=O
: