Target
Dual specificity protein phosphatase 22
Ligand
BDBM50168897
Substrate
Meas. Tech.
ChEMBL_305310 (CHEMBL831701)
IC50
26000±n/a nM
Citation
 Cutshall, NSO'Day, CPrezhdo, M Rhodanine derivatives as inhibitors of JSP-1. Bioorg Med Chem Lett 15:3374-9 (2005)  
Target
Name:
Dual specificity protein phosphatase 22
Synonyms:
DUS22_HUMAN Dual specificity phosphatase 22 Dual specificity protein phosphatase 22 Dual specificity protein phosphatase VHX (VHX) LMWDSP2 Mitogen-activated protein kinase phosphatase x | VHX
Type:
Protein
Mol. Mass.:
20915.83
Organism:
Homo sapiens (Human)
Description:
Q9NRW4
Residue:
184
  
Inhibitor
Name:
BDBM50168897
Synonyms:
3-{5-[1-(4-Methoxy-phenyl)-meth-(Z)-ylidene]-4-oxo-2-thioxo-thiazolidin-3-yl}-benzoic acid | CHEMBL183336
Type:
Small organic molecule
Emp. Form.:
C18H13NO4S2
Mol. Mass.:
371.43
SMILES:
COc1ccc(\C=C2/SC(=S)N(C2=O)c2cccc(c2)C(O)=O)cc1
: