Target
alpha-1,2-Mannosidase
Ligand
BDBM50168988
Substrate
Meas. Tech.
ChEMBL_302683 (CHEMBL839445)
Ki
9500±n/a nM
Citation
 Fiaux, HPopowycz, FFavre, SSchütz, CVogel, PGerber-Lemaire, SJuillerat-Jeanneret, L Functionalized pyrrolidines inhibit alpha-mannosidase activity and growth of human glioblastoma and melanoma cells. J Med Chem 48:4237-46 (2005)  
Target
Name:
alpha-1,2-Mannosidase
Synonyms:
Alpha-mannosidase
Type:
PROTEIN
Mol. Mass.:
65344.50
Organism:
Glycine max
Description:
ChEMBL_32380
Residue:
578
  
Inhibitor
Name:
BDBM50168988
Synonyms:
(2R,3R,4S)-2-({[(1R)-2-HYDROXY-1-PHENYLETHYL]AMINO}METHYL)PYRROLIDINE-3,4-DIOL | CHEMBL425723
Type:
Small organic molecule
Emp. Form.:
C13H20N2O3
Mol. Mass.:
252.3095
SMILES:
OC[C@H](NC[C@H]1NC[C@H](O)[C@@H]1O)c1ccccc1
: