Target
alpha-1,2-Mannosidase
Ligand
BDBM50168994
Substrate
Meas. Tech.
ChEMBL_305169 (CHEMBL832759)
IC50
63000±n/a nM
Citation
 Fiaux, HPopowycz, FFavre, SSchütz, CVogel, PGerber-Lemaire, SJuillerat-Jeanneret, L Functionalized pyrrolidines inhibit alpha-mannosidase activity and growth of human glioblastoma and melanoma cells. J Med Chem 48:4237-46 (2005)  
Target
Name:
alpha-1,2-Mannosidase
Synonyms:
Alpha-mannosidase
Type:
PROTEIN
Mol. Mass.:
65344.50
Organism:
Glycine max
Description:
ChEMBL_32380
Residue:
578
  
Inhibitor
Name:
BDBM50168994
Synonyms:
2-Fluoro-benzoic acid 2-[((2R,3R,4S)-3,4-dihydroxy-pyrrolidin-2-ylmethyl)-amino]-2-phenyl-ethyl ester | CHEMBL191531
Type:
Small organic molecule
Emp. Form.:
C20H23FN2O4
Mol. Mass.:
374.406
SMILES:
O[C@H]1CN[C@H](CNC(COC(=O)c2ccccc2F)c2ccccc2)[C@H]1O
: