Target
Sodium-dependent serotonin transporter
Ligand
BDBM50169004
Substrate
Meas. Tech.
ChEMBL_303776 (CHEMBL830133)
Ki
0.49±n/a nM
Citation
 Jarkas, NMcConathy, JVoll, RJGoodman, MM Synthesis, in vitro characterization, and radiolabeling of N,N-dimethyl-2-(2'-amino-4'-substituted-phenylthio)benzylamines: potential candidates as selective serotonin transporter radioligands. J Med Chem 48:4254-65 (2005)  
Target
Name:
Sodium-dependent serotonin transporter
Synonyms:
5-HT Transporter 5HTT SC6A4_HUMAN SLC6A4 Serotonin transporter (5HTT) Sodium-dependent serotonin transporter (SERT) | Solute carrier family 6 member 4
Type:
Multi-pass membrane protein
Mol. Mass.:
70322.51
Organism:
Homo sapiens (Human)
Description:
P31645
Residue:
630
  
Inhibitor
Name:
BDBM50169004
Synonyms:
2-(2-Dimethylaminomethyl-phenylsulfanyl)-5-ethyl-phenylamine | CHEMBL189367
Type:
Small organic molecule
Emp. Form.:
C17H22N2S
Mol. Mass.:
286.435
SMILES:
CCc1ccc(Sc2ccccc2CN(C)C)c(N)c1
: