Target
Sodium-dependent serotonin transporter
Ligand
BDBM50164465
Substrate
Meas. Tech.
ChEMBL_303776 (CHEMBL830133)
Ki
0.57±n/a nM
Citation
 Jarkas, NMcConathy, JVoll, RJGoodman, MM Synthesis, in vitro characterization, and radiolabeling of N,N-dimethyl-2-(2'-amino-4'-substituted-phenylthio)benzylamines: potential candidates as selective serotonin transporter radioligands. J Med Chem 48:4254-65 (2005)  
Target
Name:
Sodium-dependent serotonin transporter
Synonyms:
5-HT Transporter 5HTT SC6A4_HUMAN SLC6A4 Serotonin transporter (5HTT) Sodium-dependent serotonin transporter (SERT) | Solute carrier family 6 member 4
Type:
Multi-pass membrane protein
Mol. Mass.:
70322.51
Organism:
Homo sapiens (Human)
Description:
P31645
Residue:
630
  
Inhibitor
Name:
BDBM50164465
Synonyms:
CHEMBL190937 [3-Amino-4-(2-dimethylaminomethyl-phenylsulfanyl)-phenyl]-methanol
Type:
Small organic molecule
Emp. Form.:
C16H20N2OS
Mol. Mass.:
288.408
SMILES:
CN(C)Cc1ccccc1Sc1ccc(CO)cc1N
: