Target
Plasmepsin I
Ligand
BDBM50169102
Substrate
Meas. Tech.
ChEMBL_302875 (CHEMBL828789)
Ki
3.3±n/a nM
Citation
 Johansson, POLindberg, JBlackman, MJKvarnström, IVrang, LHamelink, EHallberg, ARosenquist, ASamuelsson, B Design and synthesis of potent inhibitors of plasmepsin I and II: X-ray crystal structure of inhibitor in complex with plasmepsin II. J Med Chem 48:4400-9 (2005)  
Target
Name:
Plasmepsin I
Synonyms:
PFAPG PMI Plasmepsin-1 precursor
Type:
Enzyme
Mol. Mass.:
51463.30
Organism:
Plasmodium falciparum
Description:
Residue:
452
  
Inhibitor
Name:
BDBM50169102
Synonyms:
CHEMBL189976 | N-{(1S,2S)-1-(4-Benzo[1,3]dioxol-5-yl-benzyloxymethyl)-3-[(S)-1-((S)-1-carbamoyl-3-methyl-butylcarbamoyl)-ethylcarbamoyl]-2-hydroxy-propyl}-2,4,6-trifluoro-benzamide
Type:
Small organic molecule
Emp. Form.:
C35H39F3N4O8
Mol. Mass.:
700.7014
SMILES:
CC(C)C[C@H](NC(=O)[C@H](C)NC(=O)C[C@H](O)[C@H](COCc1ccc(cc1)-c1ccc2OCOc2c1)NC(=O)c1c(F)cc(F)cc1F)C(N)=O
: