Target
Plasmepsin II
Ligand
BDBM50169100
Substrate
Meas. Tech.
ChEMBL_302894 (CHEMBL830210)
Ki
1.1±n/a nM
Citation
 Johansson, POLindberg, JBlackman, MJKvarnström, IVrang, LHamelink, EHallberg, ARosenquist, ASamuelsson, B Design and synthesis of potent inhibitors of plasmepsin I and II: X-ray crystal structure of inhibitor in complex with plasmepsin II. J Med Chem 48:4400-9 (2005)  
Target
Name:
Plasmepsin II
Synonyms:
Aspartic hemoglobinase II PLM2_PLAFX Plasmepsin 2 Plasmepsin-II
Type:
Enzyme
Mol. Mass.:
51482.09
Organism:
Plasmodium falciparum
Description:
P46925
Residue:
453
  
Inhibitor
Name:
BDBM50169100
Synonyms:
CHEMBL191260 | Pyridine-2-carboxylic acid {(S)-1-[(1S,2S)-3-[(S)-1-((S)-1-aminomethyl-3-methyl-butylcarbamoyl)-ethylcarbamoyl]-2-hydroxy-1-(4-thiophen-3-yl-benzyloxymethyl)-propylcarbamoyl]-2-methyl-propyl}-amide
Type:
Small organic molecule
Emp. Form.:
C36H48N6O7S
Mol. Mass.:
708.867
SMILES:
CC(C)C[C@H](NC(=O)[C@H](C)NC(=O)C[C@H](O)[C@H](COCc1ccc(cc1)-c1ccsc1)NC(=O)[C@@H](NC(=O)c1ccccn1)C(C)C)C(N)=O
: