Target
5-hydroxytryptamine receptor 2B
Ligand
BDBM50169259
Substrate
Meas. Tech.
ChEMBL_303086 (CHEMBL828758)
Ki
13±n/a nM
Citation
 Röver, SAdams, DRBénardeau, ABentley, JMBickerdike, MJBourson, ACliffe, IACoassolo, PDavidson, JEDourish, CTHebeisen, PKennett, GAKnight, ARMalcolm, CSMattei, PMisra, AMizrahi, JMuller, MPorter, RHRichter, HTaylor, SVickers, SP Identification of 4-methyl-1,2,3,4,10,10a-hexahydropyrazino[1,2-a]indoles as 5-HT2C receptor agonists. Bioorg Med Chem Lett 15:3604-8 (2005)  
Target
Name:
5-hydroxytryptamine receptor 2B
Synonyms:
5-HT-2B 5-hydroxytryptamine (serotonin) receptor 2B [Homo sapiens] 5-hydroxytryptamine receptor 2C (5HT2C) HTR2B Serotonin 2b (5-HT2b) receptor | Serotonin Receptor 2B
Type:
G Protein-Coupled Receptor (GPCR)
Mol. Mass.:
54312.47
Organism:
Homo sapiens (Human)
Description:
Receptor binding assays were performed using human clone stably expressed in CHO cells.
Residue:
481
  
Inhibitor
Name:
BDBM50169259
Synonyms:
(4R,10aR)-4,6,7-Trimethyl-1,2,3,4,10,10a-hexahydro-pyrazino[1,2-a]indole | CHEMBL188033
Type:
Small organic molecule
Emp. Form.:
C14H20N2
Mol. Mass.:
216.322
SMILES:
C[C@@H]1CNC[C@H]2Cc3ccc(C)c(C)c3N12
: