Target
Adenosine receptor A2a
Ligand
BDBM50169318
Substrate
Meas. Tech.
ChEMBL_302654 (CHEMBL839943)
Ki
1.9±n/a nM
Citation
 Matasi, JJCaldwell, JPZhang, HFawzi, ACohen-Williams, MEVarty, GBTulshian, DB 2-(2-Furanyl)-7-phenyl[1,2,4]triazolo[1,5-c]pyrimidin-5-amine analogs: highly potent, orally active, adenosine A2A antagonists. Part 1. Bioorg Med Chem Lett 15:3670-4 (2005)  
Target
Name:
Adenosine receptor A2a
Synonyms:
AA2AR_RAT Adenosine A2 receptor Adenosine Receptors A2a (A2a) Adenosine receptors A2a Rat striatal adenosine A2a receptor
Type:
G Protein-Coupled Receptor (GPCR)
Mol. Mass.:
45015.65
Organism:
Rattus norvegicus (rat)
Description:
Rat A2A receptors expressed in CHO cells.
Residue:
410
  
Inhibitor
Name:
BDBM50169318
Synonyms:
2-Furan-2-yl-7-pyridin-4-yl-[1,2,4]triazolo[1,5-c]pyrimidin-5-ylamine | CHEMBL180109
Type:
Small organic molecule
Emp. Form.:
C14H10N6O
Mol. Mass.:
278.2688
SMILES:
Nc1nc(cc2nc(nn12)-c1ccco1)-c1ccncc1
: