Target
Melanin-concentrating hormone receptor 1
Ligand
BDBM50169371
Substrate
Meas. Tech.
ChEMBL_303523 (CHEMBL839637)
Ki
0.17±n/a nM
Citation
 Guo, TShao, YQian, GRokosz, LLStauffer, TMHunter, RCBabu, SDGu, HHobbs, DW Discovery and SAR of biaryl piperidine MCH1 receptor antagonists through solid-phase encoded combinatorial synthesis. Bioorg Med Chem Lett 15:3696-700 (2005)  
Target
Name:
Melanin-concentrating hormone receptor 1
Synonyms:
G-protein coupled receptor 24 MCH receptor 1 MCH-R1 MCHR-1 MCHR1_HUMAN Melanin-Concentrating Hormone Receptor 1 (MCH1R) Melanin-concentrating hormone receptor 1 (MCH-1) Melanin-concentrating hormone receptor 1 (MCHR-1) SLC-1 Somatostatin receptor-like protein
Type:
G Protein-Coupled Receptor (GPCR)
Mol. Mass.:
45976.27
Organism:
Homo sapiens (Human)
Description:
Membranes from CHO-K1 cells stably expressing human MCH1R were used in assays.
Residue:
422
  
Inhibitor
Name:
BDBM50169371
Synonyms:
1-[4-(3'-Cyano-biphenyl-4-yl)-1-cyclopropylmethyl-piperidin-4-ylmethyl]-3-(3,5-dichloro-phenyl)-urea | CHEMBL176219
Type:
Small organic molecule
Emp. Form.:
C30H30Cl2N4O
Mol. Mass.:
533.491
SMILES:
Clc1cc(Cl)cc(NC(=O)NCC2(CCN(CC3CC3)CC2)c2ccc(cc2)-c2cccc(c2)C#N)c1
: