Target
Cathepsin L2
Ligand
BDBM50169496
Substrate
Meas. Tech.
ChEMBL_306540 (CHEMBL827829)
IC50
1600±n/a nM
Citation
 Barrett, DGBoncek, VMCatalano, JGDeaton, DNHassell, AMJurgensen, CHLong, STMcFadyen, RBMiller, ABMiller, LRPayne, JARay, JASamano, VShewchuk, LMTavares, FXWells-Knecht, KJWillard, DHWright, LLZhou, HQ P2-P3 conformationally constrained ketoamide-based inhibitors of cathepsin K. Bioorg Med Chem Lett 15:3540-6 (2005)  
Target
Name:
Cathepsin L2
Synonyms:
CATL2 CTSL2 CTSV Cathepsin V
Type:
Enzyme
Mol. Mass.:
37341.06
Organism:
Homo sapiens (Human)
Description:
O60911
Residue:
334
  
Inhibitor
Name:
BDBM50169496
Synonyms:
(R)-3,3-dimethyl-1-(5-phenyl-1,3,4-oxadiazol-2-yl)butan-2-yl(S)-1,2-dioxo-1-((R)-1-phenylethylamino)heptan-3-ylcarbamate [(S)-1-(1-Phenyl-ethylaminooxalyl)-pentyl]-carbamic acid (R)-2,2-dimethyl-1-(5-phenyl-[1,3,4]oxadiazol-2-ylmethyl)-propyl ester
Type:
Small organic molecule
Emp. Form.:
C30H38N4O5
Mol. Mass.:
534.6465
SMILES:
CCCC[C@H](NC(=O)O[C@H](Cc1nnc(o1)-c1ccccc1)C(C)(C)C)C(=O)C(=O)N[C@H](C)c1ccccc1
: