Target
Dual specificity calcium/calmodulin-dependent 3',5'-cyclic nucleotide phosphodiesterase 1A/1B/1C
Ligand
BDBM50169641
Substrate
Meas. Tech.
ChEMBL_304851 (CHEMBL828410)
IC50
20±n/a nM
Citation
 Haning, HNiewöhner, USchenke, TLampe, THillisch, ABischoff, E Comparison of different heterocyclic scaffolds as substrate analog PDE5 inhibitors. Bioorg Med Chem Lett 15:3900-7 (2005)  
Target
Name:
Dual specificity calcium/calmodulin-dependent 3',5'-cyclic nucleotide phosphodiesterase 1A/1B/1C
Synonyms:
Phosphodiesterase 1
Type:
Mol. Mass.:
Description:
Combinations of UniProts
Components:
This complex has 3 components.
Component 1
Name:
Dual specificity calcium/calmodulin-dependent 3',5'-cyclic nucleotide phosphodiesterase 1C
Synonyms:
3',5'-cyclic-AMP phosphodiesterase Calcium/calmodulin-dependent 3',5'-cyclic nucleotide phosphodiesterase 1C Hcam3 PDE1C_HUMAN Phosphodiesterase 1C | Phosphodiesterase, PDE1/PDE5
Type:
Enzyme
Mol. Mass.:
80778.58
Organism:
Homo sapiens (Human)
Description:
Q14123
Residue:
709
  
Component 2
Name:
Dual specificity calcium/calmodulin-dependent 3',5'-cyclic nucleotide phosphodiesterase 1A
Synonyms:
61 kDa Cam-PDE Cam-PDE 1A PDE1A_HUMAN | hCam-1
Type:
Protein
Mol. Mass.:
61245.69
Organism:
Homo sapiens (Human)
Description:
P54750
Residue:
535
  
Component 3
Name:
Dual specificity calcium/calmodulin-dependent 3',5'-cyclic nucleotide phosphodiesterase 1B
Synonyms:
63 kDa Cam-PDE Calcium/calmodulin-dependent 3',5'-cyclic nucleotide phosphodiesterase 1B PDE1B PDE1B_HUMAN Phosphodiesterase 1B Phosphodiesterase Type 1 (PDE1B) | Phosphodiesterase, PDE1/PDE5
Type:
Enzyme
Mol. Mass.:
61366.51
Organism:
Homo sapiens (Human)
Description:
Residue:
536
  
Inhibitor
Name:
BDBM50169641
Synonyms:
2-{2-Ethoxy-5-[4-(2-hydroxy-ethyl)-piperazine-1-sulfonyl]-phenyl}-5-methyl-7-propyl-3H-imidazo[5,1-f][1,2,4]triazin-4-one | CHEMBL182179
Type:
Small organic molecule
Emp. Form.:
C23H32N6O5S
Mol. Mass.:
504.602
SMILES:
CCCc1nc(C)c2n1nc([nH]c2=O)-c1cc(ccc1OCC)S(=O)(=O)N1CCN(CCO)CC1
: