Target
Dual specificity calcium/calmodulin-dependent 3',5'-cyclic nucleotide phosphodiesterase 1A/1B/1C
Ligand
BDBM50169643
Substrate
Meas. Tech.
ChEMBL_304851 (CHEMBL828410)
IC50
30±n/a nM
Citation
 Haning, HNiewöhner, USchenke, TLampe, THillisch, ABischoff, E Comparison of different heterocyclic scaffolds as substrate analog PDE5 inhibitors. Bioorg Med Chem Lett 15:3900-7 (2005)  
Target
Name:
Dual specificity calcium/calmodulin-dependent 3',5'-cyclic nucleotide phosphodiesterase 1A/1B/1C
Synonyms:
Phosphodiesterase 1
Type:
Mol. Mass.:
Description:
Combinations of UniProts
Components:
This complex has 3 components.
Component 1
Name:
Dual specificity calcium/calmodulin-dependent 3',5'-cyclic nucleotide phosphodiesterase 1C
Synonyms:
3',5'-cyclic-AMP phosphodiesterase Calcium/calmodulin-dependent 3',5'-cyclic nucleotide phosphodiesterase 1C Hcam3 PDE1C_HUMAN Phosphodiesterase 1C | Phosphodiesterase, PDE1/PDE5
Type:
Enzyme
Mol. Mass.:
80778.58
Organism:
Homo sapiens (Human)
Description:
Q14123
Residue:
709
  
Component 2
Name:
Dual specificity calcium/calmodulin-dependent 3',5'-cyclic nucleotide phosphodiesterase 1A
Synonyms:
61 kDa Cam-PDE Cam-PDE 1A PDE1A_HUMAN | hCam-1
Type:
Protein
Mol. Mass.:
61245.69
Organism:
Homo sapiens (Human)
Description:
P54750
Residue:
535
  
Component 3
Name:
Dual specificity calcium/calmodulin-dependent 3',5'-cyclic nucleotide phosphodiesterase 1B
Synonyms:
63 kDa Cam-PDE Calcium/calmodulin-dependent 3',5'-cyclic nucleotide phosphodiesterase 1B PDE1B PDE1B_HUMAN Phosphodiesterase 1B Phosphodiesterase Type 1 (PDE1B) | Phosphodiesterase, PDE1/PDE5
Type:
Enzyme
Mol. Mass.:
61366.51
Organism:
Homo sapiens (Human)
Description:
Residue:
536
  
Inhibitor
Name:
BDBM50169643
Synonyms:
8-Cyclopentyl-2-{2-ethoxy-5-[4-(2-hydroxy-ethyl)-piperazine-1-sulfonyl]-phenyl}-6-methyl-3H-imidazo[1,5-a][1,3,5]triazin-4-one | CHEMBL183150
Type:
Small organic molecule
Emp. Form.:
C25H34N6O5S
Mol. Mass.:
530.64
SMILES:
CCOc1ccc(cc1-c1nc2c(nc(C)n2c(=O)[nH]1)C1CCCC1)S(=O)(=O)N1CCN(CCO)CC1
: