Target
Methionine aminopeptidase 1
Ligand
BDBM50169669
Substrate
Meas. Tech.
ChEMBL_311969 (CHEMBL834386)
IC50
250±n/a nM
Citation
 Cui, YMHuang, QQXu, JChen, LLLi, JYYe, QZLi, JNan, FJ Identification of potent type I MetAP inhibitors by simple bioisosteric replacement. Part 1: Synthesis and preliminary SAR studies of thiazole-4-carboxylic acid thiazol-2-ylamide derivatives. Bioorg Med Chem Lett 15:3732-6 (2005)  
Target
Name:
Methionine aminopeptidase 1
Synonyms:
MAP 1 MAP1_YEAST Peptidase M 1
Type:
PROTEIN
Mol. Mass.:
43382.92
Organism:
Saccharomyces cerevisiae
Description:
ChEMBL_10701
Residue:
387
  
Inhibitor
Name:
BDBM50169669
Synonyms:
5-(Cyclobutanecarbonyl-amino)-thiazole-4-carboxylic acid thiazol-2-ylamide | CHEMBL360955
Type:
Small organic molecule
Emp. Form.:
C12H12N4O2S2
Mol. Mass.:
308.379
SMILES:
O=C(Nc1scnc1C(=O)Nc1nccs1)C1CCC1
: