Target
Basic phospholipase A2 PLA-A
Ligand
BDBM50169759
Substrate
Meas. Tech.
ChEMBL_305905 (CHEMBL832620)
IC50
139000±n/a nM
Citation
 Khanum, SAMurari, SKVishwanth, BSShashikanth, S Synthesis of benzoyl phenyl benzoates as effective inhibitors for phospholipase A2 and hyaluronidase enzymes. Bioorg Med Chem Lett 15:4100-4 (2005)  
Target
Name:
Basic phospholipase A2 PLA-A
Synonyms:
PA2BA_PROFL | Phospholipase A2 isozyme PLA-A
Type:
PROTEIN
Mol. Mass.:
14058.15
Organism:
Trimeresurus flavoviridis
Description:
ChEMBL_305905
Residue:
122
  
Inhibitor
Name:
BDBM50169759
Synonyms:
2-Methyl-benzoic acid 4-methyl-2-(2-methyl-benzoyl)-phenyl ester CHEMBL189359
Type:
Small organic molecule
Emp. Form.:
C23H20O3
Mol. Mass.:
344.4031
SMILES:
Cc1ccc(OC(=O)c2ccccc2C)c(c1)C(=O)c1ccccc1C
: