Target
5-hydroxytryptamine receptor 2A
Ligand
BDBM50169845
Substrate
Meas. Tech.
ChEMBL_302363 (CHEMBL828082)
Ki
2±n/a nM
Citation
 Fish, LRGilligan, MTHumphries, ACIvarsson, MLadduwahetty, TMerchant, KJO'Connor, DPatel, SPhilipps, EVargas, HMHutson, PHMacLeod, AM 4-Fluorosulfonylpiperidines: selective 5-HT2A ligands for the treatment of insomnia. Bioorg Med Chem Lett 15:3665-9 (2005)  
Target
Name:
5-hydroxytryptamine receptor 2A
Synonyms:
5-HT-2 5-HT2A 5-hydroxytryptamine receptor 2A (5HT-2A) 5HT2A_HUMAN HTR2A | Serotonin receptor 2A
Type:
undefined
Mol. Mass.:
52607.65
Organism:
Homo sapiens (Human)
Description:
P28223
Residue:
471
  
Inhibitor
Name:
BDBM50169845
Synonyms:
1-[2-(2,4-Difluoro-phenyl)-ethyl]-4-fluoro-4-(4-pyrazol-1-yl-benzenesulfonyl)-piperidine | CHEMBL178055
Type:
Small organic molecule
Emp. Form.:
C22H22F3N3O2S
Mol. Mass.:
449.489
SMILES:
Fc1ccc(CCN2CCC(F)(CC2)S(=O)(=O)c2ccc(cc2)-n2cccn2)c(F)c1
: