Target
Cannabinoid receptor 1
Ligand
BDBM50169954
Substrate
Meas. Tech.
ChEMBL_302959 (CHEMBL828804)
Ki
79.7±n/a nM
Citation
 Lu, DMeng, ZThakur, GAFan, PSteed, JTartal, CLHurst, DPReggio, PHDeschamps, JRParrish, DAGeorge, CJärbe, TULamb, RJMakriyannis, A Adamantyl cannabinoids: a novel class of cannabinergic ligands. J Med Chem 48:4576-85 (2005)  
Target
Name:
Cannabinoid receptor 1
Synonyms:
Brain-type cannabinoid receptor CB-R CNR1_RAT Cannabinoid receptor Cnr1 | Skr6
Type:
G Protein-Coupled Receptor (GPCR)
Mol. Mass.:
52856.55
Organism:
Rattus norvegicus (rat)
Description:
P20272
Residue:
473
  
Inhibitor
Name:
BDBM50169954
Synonyms:
(6aR,10aR)-3-Adamantan-2-ylmethyl-6,6,9-trimethyl-6a,7,10,10a-tetrahydro-6H-benzo[c]chromen-1-ol CHEMBL372866
Type:
Small organic molecule
Emp. Form.:
C27H36O2
Mol. Mass.:
392.5735
SMILES:
CC1=CC[C@@H]2[C@@H](C1)c1c(O)cc(CC3C4CC5CC(C4)CC3C5)cc1OC2(C)C
: