Target
Macrophage metalloelastase
Ligand
BDBM50170208
Substrate
Meas. Tech.
ChEMBL_306214 (CHEMBL831123)
IC50
460±n/a nM
Citation
 Dublanchet, ACDucrot, PAndrianjara, CO'Gara, MMorales, RCompère, DDenis, ABlais, SCluzeau, PCourté, KHamon, JMoreau, FPrunet, MLTertre, A Structure-based design and synthesis of novel non-zinc chelating MMP-12 inhibitors. Bioorg Med Chem Lett 15:3787-90 (2005)  
Target
Name:
Macrophage metalloelastase
Synonyms:
HME MMP12_HUMAN Matrix metalloproteinase-12 (MMP 12) Matrix metalloproteinase-12 (MMP12) | Matrix metalloproteinases 12 (MMP-12)
Type:
Enzyme
Mol. Mass.:
54012.99
Organism:
Homo sapiens (Human)
Description:
P39900
Residue:
470
  
Inhibitor
Name:
BDBM50170208
Synonyms:
4-(4-Cyclohexyl-phenyl)-thiophene-2-carboxylic acid (2-morpholin-4-yl-ethyl)-amide | CHEMBL180875
Type:
Small organic molecule
Emp. Form.:
C23H30N2O2S
Mol. Mass.:
398.562
SMILES:
O=C(NCCN1CCOCC1)c1cc(cs1)-c1ccc(cc1)C1CCCCC1
: