Target
Neuronal acetylcholine receptor subunit alpha-4/beta-2
Ligand
BDBM50170270
Substrate
Meas. Tech.
ChEMBL_304172 (CHEMBL877117)
EC50
150000±n/a nM
Citation
 Papke, RLZheng, GHorenstein, NADwoskin, LPCrooks, PA The characterization of a novel rigid nicotine analog with alpha7-selective nAChR agonist activity and modulation of agonist properties by boron inclusion. Bioorg Med Chem Lett 15:3874-80 (2005)  
Target
Name:
Neuronal acetylcholine receptor subunit alpha-4/beta-2
Synonyms:
Neuronal acetylcholine receptor alpha4/beta2 Neuronal acetylcholine receptor; alpha4/beta2
Type:
Mol. Mass.:
Description:
Components:
This complex has 0 components.
Component 1
Name:
Neuronal acetylcholine receptor subunit alpha-4
Synonyms:
ACHA4_RAT Cholinergic, Nicotinic Alpha4Beta2 Chrna4 Neuronal acetylcholine receptor (alpha4beta2 nAChR) Neuronal acetylcholine receptor subunit alpha 4 beta 2 | Neuronal acetylcholine receptor subunit alpha-4
Type:
Enzyme
Mol. Mass.:
70196.44
Organism:
Rattus norvegicus (Rat)
Description:
P09483
Residue:
630
  
Component 2
Name:
Neuronal acetylcholine receptor subunit beta-2
Synonyms:
ACHB2_RAT Chrnb2 Neuronal acetylcholine receptor non-alpha-1 chain
Type:
Enzyme
Mol. Mass.:
56910.32
Organism:
Rattus norvegicus (Rat)
Description:
P12390
Residue:
500
  
Inhibitor
Name:
BDBM50170270
Synonyms:
CHEMBL182530 | S(-)nicotine-B
Type:
Small organic molecule
Emp. Form.:
C11H15BN3
Mol. Mass.:
200.067
SMILES:
CN1CCC[C@H]1c1ccc[n+](BC#N)c1
: