Target
Matrilysin
Ligand
BDBM28485
Substrate
Meas. Tech.
ChEMBL_310125 (CHEMBL838107)
EC50
4±n/a nM
Citation
 Wu, JRush, TSHotchandani, RDu, XGeck, MCollins, EXu, ZBSkotnicki, JLevin, JILovering, FE Identification of potent and selective MMP-13 inhibitors. Bioorg Med Chem Lett 15:4105-9 (2005)  
Target
Name:
Matrilysin
Synonyms:
MMP7 MPSL1 Matrix metalloproteinase-7 (MMP-7) PUMP1
Type:
Enzyme
Mol. Mass.:
29681.54
Organism:
Homo sapiens (Human)
Description:
P09237
Residue:
267
  
Inhibitor
Name:
BDBM28485
Synonyms:
(2S)-2-({4-[4-(1-benzofuran-2-amido)phenyl]benzene}sulfonamido)-3-methylbutanoic acid benzofuran, 1
Type:
Small organic molecule
Emp. Form.:
C26H24N2O6S
Mol. Mass.:
492.544
SMILES:
CC(C)[C@H](NS(=O)(=O)c1ccc(cc1)-c1ccc(NC(=O)c2cc3ccccc3o2)cc1)C(O)=O
: