Target
Cannabinoid receptor 2
Ligand
BDBM50170337
Substrate
Meas. Tech.
ChEMBL_302853 (CHEMBL828769)
Ki
20±n/a nM
Citation
 Huffman, JWSzklennik, PVAlmond, ABushell, KSelley, DEHe, HCassidy, MPWiley, JLMartin, BR 1-Pentyl-3-phenylacetylindoles, a new class of cannabimimetic indoles. Bioorg Med Chem Lett 15:4110-3 (2005)  
Target
Name:
Cannabinoid receptor 2
Synonyms:
CANNABINOID CB2 CB2 CB2B CNR2_HUMAN Cannabinoid CB2 receptor Cannabinoid receptor 2 (CB2R) | hCB2
Type:
G Protein-Coupled Receptor (GPCR)
Mol. Mass.:
39690.94
Organism:
Homo sapiens (Human)
Description:
P34972
Residue:
360
  
Inhibitor
Name:
BDBM50170337
Synonyms:
2-(2-Bromo-phenyl)-1-(1-pentyl-1H-indol-3-yl)-ethanone CHEMBL363471 | JWH-249
Type:
Small organic molecule
Emp. Form.:
C21H22BrNO
Mol. Mass.:
384.309
SMILES:
CCCCCn1cc(C(=O)Cc2ccccc2Br)c2ccccc12
: