Target
Methionine aminopeptidase 1
Ligand
BDBM50170374
Substrate
Meas. Tech.
ChEMBL_304990 (CHEMBL828603)
IC50
520±n/a nM
Citation
 Cui, YMHuang, QQXu, JChen, LLLi, JYYe, QZLi, JNan, FJ Identification of potent type I MetAPs inhibitors by simple bioisosteric replacement. Part 2: SAR studies of 5-heteroalkyl substituted TCAT derivatives. Bioorg Med Chem Lett 15:4130-5 (2005)  
Target
Name:
Methionine aminopeptidase 1
Synonyms:
MAP 1 MAP1_YEAST Peptidase M 1
Type:
PROTEIN
Mol. Mass.:
43382.92
Organism:
Saccharomyces cerevisiae
Description:
ChEMBL_10701
Residue:
387
  
Inhibitor
Name:
BDBM50170374
Synonyms:
5-[2-(3-Chloro-phenyl)-2-methoxy-ethyl]-thiazole-4-carboxylic acid thiazol-2-ylamide | CHEMBL361307
Type:
Small organic molecule
Emp. Form.:
C16H14ClN3O2S2
Mol. Mass.:
379.884
SMILES:
COC(Cc1scnc1C(=O)Nc1nccs1)c1cccc(Cl)c1
: