Target
Tubulin beta chain [1-43]
Ligand
BDBM50005480
Substrate
Meas. Tech.
ChEMBL_311661 (CHEMBL840833)
IC50
2000±n/a nM
Citation
 Romagnoli, RBaraldi, PGJung, MKIaconinoto, MACarrion, MDRemusat, VPreti, DTabrizi, MAFrancesca, FDe Clercq, EBalzarini, JHamel, E Synthesis and preliminary biological evaluation of new anti-tubulin agents containing different benzoheterocycles. Bioorg Med Chem Lett 15:4048-52 (2005)  
Target
Name:
Tubulin beta chain [1-43]
Synonyms:
Beta tubulin | TBB_LEIME
Type:
PROTEIN
Mol. Mass.:
4652.47
Organism:
Leishmania donovani
Description:
ChEMBL_311916
Residue:
43
  
Inhibitor
Name:
BDBM50005480
Synonyms:
(-)-combretastatin (Z)-5-(3,4,5-trimethoxystyryl)-2-methoxyphenol (combretastin A-4)2-Methoxy-5-[2-(3,4,5-trimethoxy-phenyl)-vinyl]-phenol 2-Methoxy-5-[(Z)-2-(3,4,5-trimethoxy-phenyl)-vinyl]-phenol 2-methoxy-5-(3,4,5-trimethoxystyryl)phenol 5-(3,4,5-trimethoxystyryl)-2-methoxyphenol CHEMBL67 Combrestatin A4 Combretastatin Combretastin A-4 combretastatin A-4, (CSA4) | combretastin A4
Type:
Small organic molecule
Emp. Form.:
C18H20O5
Mol. Mass.:
316.3484
SMILES:
COc1ccc(\C=C/c2cc(OC)c(OC)c(OC)c2)cc1O
: