Target
Carbonic anhydrase 1
Ligand
BDBM50170760
Substrate
Meas. Tech.
ChEMBL_302179 (CHEMBL830213)
Ki
980±n/a nM
Citation
 Cecchi, AHulikova, APastorek, JPastoreková, SScozzafava, AWinum, JYMontero, JLSupuran, CT Carbonic anhydrase inhibitors. Design of fluorescent sulfonamides as probes of tumor-associated carbonic anhydrase IX that inhibit isozyme IX-mediated acidification of hypoxic tumors. J Med Chem 48:4834-41 (2005)  
Target
Name:
Carbonic anhydrase 1
Synonyms:
CA-I CAB Carbonate dehydratase I Carbonic anhydrase 1 (CA I) Carbonic anhydrase 1 (Recombinant CA I) Carbonic anhydrase B Carbonic anhydrase I (CA I) Carbonic anhydrase I (CAI) Carbonic anhydrase isoenzyme I (hCA I) | hCA
Type:
Enzyme
Mol. Mass.:
28873.37
Organism:
Homo sapiens (Human)
Description:
P00915
Residue:
261
  
Inhibitor
Name:
BDBM50170760
Synonyms:
5-[3-(2-Fluoro-4-sulfamoyl-phenyl)-thioureido]-2-(6-hydroxy-3-oxo-3H-xanthen-9-yl)-benzoic acid | CHEMBL187974
Type:
Small organic molecule
Emp. Form.:
C27H18FN3O7S2
Mol. Mass.:
579.576
SMILES:
[#7]S(=O)(=O)c1ccc(-[#7]-[#6](=S)-[#7]=[#6]-2-[#6]=[#6]\[#6](-[#6](=[#6]-2)-[#6](-[#8])=O)=[#6]-2\c3ccc(-[#8])cc3-[#8]-c3cc(-[#8])ccc-23)c(F)c1
: