Target
Carbonic anhydrase 2
Ligand
BDBM50170763
Substrate
Meas. Tech.
ChEMBL_302178 (CHEMBL830081)
Ki
27±n/a nM
Citation
 Cecchi, AHulikova, APastorek, JPastoreková, SScozzafava, AWinum, JYMontero, JLSupuran, CT Carbonic anhydrase inhibitors. Design of fluorescent sulfonamides as probes of tumor-associated carbonic anhydrase IX that inhibit isozyme IX-mediated acidification of hypoxic tumors. J Med Chem 48:4834-41 (2005)  
Target
Name:
Carbonic anhydrase 2
Synonyms:
CA-II CAC Carbonate dehydratase II Carbonic anhydrase 2 (CA-II) Carbonic anhydrase C Carbonic anhydrase II (CA-II) Carbonic anhydrase II (hCA II) | Carbonic anhydrase isoenzyme II (hCA II)
Type:
Enzyme
Mol. Mass.:
29250.71
Organism:
Homo sapiens (Human)
Description:
P00918
Residue:
260
  
Inhibitor
Name:
BDBM50170763
Synonyms:
2-(6-Hydroxy-3-oxo-3H-xanthen-9-yl)-5-{3-[4-(5-sulfamoyl-[1,3,4]thiadiazol-2-ylsulfamoyl)-phenyl]-thioureido}-benzoic acid | CHEMBL361496
Type:
Small organic molecule
Emp. Form.:
C29H20N6O9S4
Mol. Mass.:
724.764
SMILES:
NS(=O)(=O)c1nnc(NS(=O)(=O)c2ccc(NC(=S)Nc3ccc(c(c3)C(O)=O)-c3c4ccc(O)cc4oc4cc(=O)ccc34)cc2)s1
: