Target
3-dehydroquinate dehydratase
Ligand
BDBM50170806
Substrate
Meas. Tech.
ChEMBL_303633 (CHEMBL828843)
pH
8.2±n/a
Ki
150000±n/a nM
Comments
extracted
Citation
 Sánchez-Sixto, CPrazeres, VFCastedo, LLamb, HHawkins, ARGonzález-Bello, C Structure-based design, synthesis, and biological evaluation of inhibitors of Mycobacterium tuberculosis type II dehydroquinase. J Med Chem 48:4871-81 (2005)  
Target
Name:
3-dehydroquinate dehydratase
Synonyms:
AROQ_MYCTU aroQ
Type:
PROTEIN
Mol. Mass.:
15786.25
Organism:
Mycobacterium tuberculosis
Description:
ChEMBL_766423
Residue:
147
  
Inhibitor
Name:
BDBM50170806
Synonyms:
3-((3R,5R,6R)-3-Carboxy-3,5,6-trihydroxy-cyclohex-1-enyl)-benzoic acid | CHEMBL190424
Type:
Small organic molecule
Emp. Form.:
C14H14O7
Mol. Mass.:
294.2568
SMILES:
O[C@@H]1C[C@@](O)(C=C([C@H]1O)c1cccc(c1)C(O)=O)C(O)=O
: