Target
Lysophosphatidic acid receptor 1
Ligand
BDBM50170856
Substrate
Meas. Tech.
ChEMBL_312535 (CHEMBL832578)
IC50
>10000±n/a nM
Citation
 Durgam, GGVirag, TWalker, MDTsukahara, RYasuda, SLiliom, Kvan Meeteren, LAMoolenaar, WHWilke, NSiess, WTigyi, GMiller, DD Synthesis, structure-activity relationships, and biological evaluation of fatty alcohol phosphates as lysophosphatidic acid receptor ligands, activators of PPARgamma, and inhibitors of autotaxin. J Med Chem 48:4919-30 (2005)  
Target
Name:
Lysophosphatidic acid receptor 1
Synonyms:
EDG2 LPA-1 LPAR1 Lysophosphatidic acid receptor 1 (LPA1) | Lysophosphatidic acid receptor Edg-2
Type:
Enzyme
Mol. Mass.:
41120.55
Organism:
Homo sapiens (Human)
Description:
Q92633
Residue:
364
  
Inhibitor
Name:
BDBM50170856
Synonyms:
CHEMBL188081 | Phosphoric acid mono-((E)-dec-4-enyl) ester
Type:
Small organic molecule
Emp. Form.:
C10H21O4P
Mol. Mass.:
236.2451
SMILES:
CCCCC\C=C\CCCOP(O)(O)=O
: