Target
Lysophosphatidic acid receptor 3
Ligand
BDBM50170843
Substrate
Meas. Tech.
ChEMBL_303206 (CHEMBL829832)
Ki
58±n/a nM
Citation
 Durgam, GGVirag, TWalker, MDTsukahara, RYasuda, SLiliom, Kvan Meeteren, LAMoolenaar, WHWilke, NSiess, WTigyi, GMiller, DD Synthesis, structure-activity relationships, and biological evaluation of fatty alcohol phosphates as lysophosphatidic acid receptor ligands, activators of PPARgamma, and inhibitors of autotaxin. J Med Chem 48:4919-30 (2005)  
Target
Name:
Lysophosphatidic acid receptor 3
Synonyms:
EDG7 LPAR3 Lysophosphatidic acid receptor 1/3 Lysophosphatidic acid receptor Edg-7
Type:
Enzyme
Mol. Mass.:
40149.72
Organism:
Homo sapiens (Human)
Description:
Q9UBY5
Residue:
353
  
Inhibitor
Name:
BDBM50170843
Synonyms:
CHEMBL190430 | Phosphoric acid mono-((E)-tetradec-9-enyl) ester
Type:
Small organic molecule
Emp. Form.:
C14H29O4P
Mol. Mass.:
292.3514
SMILES:
CCCC\C=C\CCCCCCCCOP(O)(O)=O
: