Target
Tyrosine-protein phosphatase non-receptor type 1
Ligand
BDBM50171110
Substrate
Meas. Tech.
ChEMBL_321519 (CHEMBL880579)
IC50
6900±n/a nM
Citation
 Holmes, CPLi, XPan, YXu, CBhandari, AMoody, CMMiguel, JAFerla, SWDe Francisco, MNFrederick, BTZhou, SMacher, NJang, LIrvine, JDGrove, JR Discovery and structure-activity relationships of novel sulfonamides as potent PTP1B inhibitors. Bioorg Med Chem Lett 15:4336-41 (2005)  
Target
Name:
Tyrosine-protein phosphatase non-receptor type 1
Synonyms:
PTN1_HUMAN PTPN1 Protein tyrosine phosphatase-1B (PTP1B) Protein-tyrosine phosphatase 1B (PTP1B) Tyrosine-protein phosphatase non-receptor type 1 (PTP1B)
Type:
Protein phosphatase
Mol. Mass.:
49963.76
Organism:
Homo sapiens (Human)
Description:
Human recombinant GST-fusion PTP1B (1-435).
Residue:
435
  
Inhibitor
Name:
BDBM50171110
Synonyms:
CHEMBL424840 | [Difluoro-(4-{[(4-hydroxy-benzoyl)-(4-[1,2,3]thiadiazol-4-yl-benzyl)-amino]-methyl}-phenyl)-methyl]-phosphonic acid
Type:
Small organic molecule
Emp. Form.:
C24H20F2N3O5PS
Mol. Mass.:
531.468
SMILES:
Oc1ccc(cc1)C(=O)N(Cc1ccc(cc1)-c1csnn1)Cc1ccc(cc1)C(F)(F)P(O)(O)=O
: