Target
Dipeptidyl peptidase 4
Ligand
BDBM50171555
Substrate
Meas. Tech.
ChEMBL_321386 (CHEMBL881764)
IC50
15±n/a nM
Citation
 Shreder, KRWong, MSCorral, SYu, ZWinn, DTWu, MHu, YNomanbhoy, TAlemayehu, SFuller, SRRosenblum, JSKozarich, JW Boro-norleucine as a P1 residue for the design of selective and potent DPP7 inhibitors. Bioorg Med Chem Lett 15:4256-60 (2005)  
Target
Name:
Dipeptidyl peptidase 4
Synonyms:
ADABP Adenosine deaminase complexing protein 2 CD_antigen=CD26 DPP4 DPPIV Dipeptidyl peptidase 4 (DPP IV) Dipeptidyl peptidase 4 (DPP4) Dipeptidyl peptidase 4 membrane form Dipeptidyl peptidase IV Dipeptidyl peptidase IV (DDP-IV) Dipeptidyl peptidase IV membrane form Dipeptidyl peptidase-IV (DPP-4) T-cell activation antigen CD26 | TP103
Type:
Enzyme
Mol. Mass.:
88271.01
Organism:
Homo sapiens (Human)
Description:
P27487
Residue:
766
  
Inhibitor
Name:
BDBM50171555
Synonyms:
(S)-2,4-Diamino-1-(2-boron-dihydroxide-pyrrolidin-1-yl)-butan-1-one | CHEMBL194428
Type:
Small organic molecule
Emp. Form.:
C8H18BN3O3
Mol. Mass.:
215.058
SMILES:
NCC[C@H](N)C(=O)N1CCC[C@@H]1B(O)O
: