Target
Prolyl endopeptidase FAP
Ligand
BDBM50050517
Substrate
Meas. Tech.
ChEMBL_321506 (CHEMBL880566)
IC50
11±n/a nM
Citation
 Hu, YMa, LWu, MWong, MSLi, BCorral, SYu, ZNomanbhoy, TAlemayehu, SFuller, SRRosenblum, JSRozenkrants, NMinimo, LCRipka, WCSzardenings, AKKozarich, JWShreder, KR Synthesis and structure-activity relationship of N-alkyl Gly-boro-Pro inhibitors of DPP4, FAP, and DPP7. Bioorg Med Chem Lett 15:4239-42 (2005)  
Target
Name:
Prolyl endopeptidase FAP
Synonyms:
170 kDa melanoma membrane-bound gelatinase Fibroblast Activation Protein (FAP) Integral membrane serine protease Seprase
Type:
Enzyme
Mol. Mass.:
87712.48
Organism:
Homo sapiens (Human)
Description:
Q12884
Residue:
760
  
Inhibitor
Name:
BDBM50050517
Synonyms:
Boronic acid derivative N-alkyl Gly-boro-Pro derivative
Type:
Small organic molecule
Emp. Form.:
C9H19BN2O3
Mol. Mass.:
214.07
SMILES:
CC(C)[C@@H](N)C(=O)N1CCC[C@H]1B(O)O
: