Target
Dipeptidyl peptidase 2
Ligand
BDBM50171650
Substrate
Meas. Tech.
ChEMBL_321508 (CHEMBL880568)
IC50
4±n/a nM
Citation
 Hu, YMa, LWu, MWong, MSLi, BCorral, SYu, ZNomanbhoy, TAlemayehu, SFuller, SRRosenblum, JSRozenkrants, NMinimo, LCRipka, WCSzardenings, AKKozarich, JWShreder, KR Synthesis and structure-activity relationship of N-alkyl Gly-boro-Pro inhibitors of DPP4, FAP, and DPP7. Bioorg Med Chem Lett 15:4239-42 (2005)  
Target
Name:
Dipeptidyl peptidase 2
Synonyms:
DAP II DPP2_HUMAN Dipeptidyl aminopeptidase II Dipeptidyl peptidase 2 (DPP2) Dipeptidyl peptidase II (DPP II) Dipeptidyl peptidase II and dipeptidyl peptidase IV (DPP2 and DPP4) carboxytripeptidase dipeptidyl(amino)peptidase II | dipeptidylarylamidase
Type:
Protein
Mol. Mass.:
54339.29
Organism:
Homo sapiens (Human)
Description:
Q9UHL4
Residue:
492
  
Inhibitor
Name:
BDBM50171650
Synonyms:
2-Cyclooctonylamino-1-pyrrolidin-1-yl--2-borandihydroxy-ethanone | CHEMBL382974
Type:
Small organic molecule
Emp. Form.:
C14H27BN2O3
Mol. Mass.:
282.187
SMILES:
OB(O)[C@@H]1CCCN1C(=O)CNC1CCCCCCC1
: